{"text_format":"1","workbook":"xlsx","n_sheets":3,"sheets":["Spieler","Gruppen","Finals"],"not_rendered":{"charts":0,"images":0,"macros":1,"external_links":0,"defined_names":1,"comments":0,"pivot_tables":0},"unopened":[],"bounds":{"document_bytes":16777216,"sheet_cells":100000,"rows_first":2000,"rows_last":500,"rows_between":2000,"halvings":0,"cell_chars":16384,"cell_head_chars":4096},"cells_cut":0,"cells_raw":0,"read":"whole","date_system":"1900"}

{"sheet":"Spieler","index":0,"n_rows":42,"n_cols":14,"rows_kept":42,"cut":false,"hidden":false,"merged":[[6,6,6,8],[6,10,6,12],[0,6,0,7],[1,6,1,13],[2,9,2,10],[3,9,3,10],[4,9,4,10]]}
["   ","Spieler","Gemeldet","Startgeld 20€+15€",null,null,"Century Jackpot:",null,30.5]
[1,"Marco Weber","gemeldet","ok",{"$f":"IF(B2=\"\",0,IF(D2=\"X\",5000016,RAND()*1000*20))","v":10590.599260807638},null,"Jackpotberechnung"]
[2,"Tino Delling","gemeldet","ok",{"$f":"IF(B3=\"\",0,IF(D3=\"X\",5000014,RAND()*1000*20))","v":17159.032299022205},"Aktualisierung:","2020-08-18",null,null,"Jackpotsumme:",null,{"$f":"486","v":486},{"$f":"L3*N3","v":97.2},0.2]
[3,"Marec Stachly","gemeldet","ok",{"$f":"IF(B4=\"\",0,IF(D4=\"X\",5000013,RAND()*1000*20))","v":19494.114156891352},null,null,null,null,"Startgeld Champions Cup:",null,20,{"$f":"L4*16","v":320}]
[4,"Felix Kirsten","gemeldet","ok",{"$f":"IF(B5=\"\",0,IF(D5=\"X\",5000008,RAND()*1000*20))","v":1264.2549719983865},null,null,null,null,"Champion Cup 20%:",null,{"$f":"L3-M3","v":388.8},{"$f":"SUM(M3:M4)","v":417.2}]
[5,"Moritz Thomas","gemeldet","ok",{"$f":"IF(B6=\"\",0,IF(D6=\"X\",5000006,RAND()*1000*20))","v":2786.0493749104953}]
[6,"Gustav Hollnagel","gemeldet",null,{"$f":"IF(B7=\"\",0,IF(D7=\"X\",5000003,RAND()*1000*20))","v":17363.390749282582},null,"Gesamtjackpot",null,null,null,"Champions Cup"]
[7,"Michael Kandler","gemeldet","ok",{"$f":"IF(B8=\"\",0,IF(D8=\"X\",5000007,RAND()*1000*20))","v":2550.1036112305273},null,1,0.19,{"$f":"$L$5*H8","v":73.872},"Marco Weber","Platz 1",0.35,{"$f":"$M$5*L8","v":146.01999999999998}]
[8,"Aaron Bocksberger","gemeldet",20,{"$f":"IF(B9=\"\",0,IF(D9=\"X\",5000015,RAND()*1000*20))","v":11855.902648729832},null,2,0.15,{"$f":"$L$5*H9","v":58.32},"Tino Delling","Platz 2",0.2,{"$f":"$M$5*L9","v":83.44}]
[9,"Marko Straßburger","gemeldet","ok",{"$f":"IF(B10=\"\",0,IF(D10=\"X\",5000011,RAND()*1000*20))","v":10481.438234644856},null,3,0.12,46.655999999999999,"Marec Stachly","Platz 3",0.15,{"$f":"$M$5*L10","v":62.58}]
[10,"Andy Swennen","gemeldet","ok",{"$f":"IF(B11=\"\",0,IF(D11=\"X\",5000001,RAND()*1000*20))","v":14770.024848486772},null,4,0.1,38.880000000000003,"Felix Kirsten","Platz 4",0.1,41.72]
[11,"Sven Ohlenroth","Los",null,{"$f":"IF(B12=\"\",0,IF(D12=\"X\",5000017,RAND()*1000*20))","v":3680.3821298711914},null,5,0.06,23.327999999999999,"Moritz Thomas","Platz 5",0.05,20.86]
[12,"Daniel Schneider","Los",null,{"$f":"IF(B13=\"\",0,IF(D13=\"X\",5000010,RAND()*1000*20))","v":12360.205405716737},null,6,0.06,23.327999999999999,"Gustav Hollnagel","Platz 6",0.05,20.86]
[13,"David Gärtner","gemeldet",null,{"$f":"IF(B14=\"\",0,IF(D14=\"X\",5000005,RAND()*1000*20))","v":13907.199201124624},null,7,0.06,23.327999999999999,"Michael Kandler","Platz 7",0.05,20.86]
[14,"Jörg Bonitz","Los",null,{"$f":"IF(B15=\"\",0,IF(D15=\"X\",5000019,RAND()*1000*20))","v":13921.465545212872},null,8,0.06,23.327999999999999,"Aaron Bocksberger","Platz 8",0.05,20.86]
[15,"Christopher Jaritz","gemeldet","ok",{"$f":"IF(B16=\"\",0,IF(D16=\"X\",5000012,RAND()*1000*20))","v":19343.115315651561},null,9,0.03,11.664,"Marko Straßburger"]
[16,"Andreas Hartung","Los",null,{"$f":"IF(B17=\"\",0,IF(D17=\"X\",5000018,RAND()*1000*20))","v":16068.134727918477},null,10,0.03,11.664,"Andy Swennen","Prüfsumme:",{"$f":"SUM(L8:L15)","v":1.0000000000000002},{"$f":"SUM(M8:M15)","v":417.20000000000005}]
[null,null,null,null,null,null,11,0.03,11.664,"Thomas Krause"]
[null,"Nachrücker",null,null,null,null,12,0.03,11.664,"Paul N. Schmidt"]
[null,"Sven Ohlenroth","gemeldet","ok",null,null,13,0.02,7.7760000000000007,"David Gärtner"]
[null,"Daniel Schneider","gemeldet",20,null,null,14,0.02,7.7760000000000007,"Florian Schmidt"]
[null,"Christopher Buße","?",null,null,null,15,0.02,7.7760000000000007,"Christopher Jaritz"]
[null,"Andreas Hartung","gemeldet","ok",null,null,16,0.02,7.7760000000000007,"Ronny Rejke"]
[null,"Frank Brömel"]
[null,"Hilmar Habrom",null,null,null,null,"Prüfsumme:",{"$f":"SUM(H8:H23)","v":1.0000000000000002},{"$f":"SUM(I8:I23)","v":388.79999999999995},"30 € gehen wieder in den Jackpot (4 Spieler)"]
[null,"Frank Müller"]
[null,"Jan Utikal"]
[null,"Thomas Metzler",null,null,null,null,"Meldeschluss ist der 05.09.2020, 24:00 Uhr!"]
[null,"Rene Scheurer",null,null,null,null,"Die Nachrücker werden gelost, da mindestens 3 Top 16 Spieler nicht teilnehmen!"]
[null,"Paul Arthur Jeroch",null,null,null,null,"Jeder Nachrücker zieht sein Los am Turniertag!"]
[null,"Wei Chen",null,null,null,null,"Allen Teilnehmern des Champions Cup sind die Teilnahmebedingungen bekannt und werden akzeptiert!"]
[null,"Hannes Hermsdorf",null,null,null,null,"Nachzulesen:"," https://www.saxonian-snooker.de/3LaenderRanking/3lr-regularien.pdf"]
[null,"Holger Hänel"]
[null,"Mario Gehrke"]
[null,"Alex Nikitin"]
[null,"Justin Gruner"]
[null,"Sylvio Fischer"]
[null,"Fabian Schulze"]
[null,"Thomas Nierobisch"]
[null,"Frank Jacob"]
[null,"…"]
[null,"Jörg Bonitz","gemeldet"]

{"sheet":"Gruppen","index":1,"n_rows":34,"n_cols":29,"rows_kept":34,"cut":false,"hidden":false,"merged":[[5,19,5,20],[6,19,6,20],[0,0,4,0],[0,19,0,20],[1,19,1,20],[2,19,2,20],[3,19,3,20],[4,19,4,20],[9,0,13,0],[9,19,9,20],[10,19,10,20],[11,19,11,20],[12,19,12,20],[13,19,13,20],[14,19,14,20],[15,19,15,20],[18,0,22,0],[18,19,18,20],[19,19,19,20],[20,19,20,20],[21,19,21,20],[22,19,22,20],[32,19,32,20],[33,19,33,20],[23,19,23,20],[24,19,24,20],[27,0,31,0],[27,19,27,20],[28,19,28,20],[29,19,29,20],[30,19,30,20],[31,19,31,20]]}
["A",null,"Spieler","M","W","L","F+","F-",null,null,null,"Rang","Rang","P+",null,null,null,"Startzeit","Spieler","Spieler",null,"Breaks 30+","F+","F-",null,null,null,null,"Breaks 30+"]
[null,1,{"$f":"Spieler!B2","v":"Marco Weber"},{"$f":"Y2+Y5+Y7","v":3},{"$f":"Z2+Z5+Z7","v":1},{"$f":"AA2+AA5+AA7","v":2},{"$f":"W2+W5+W7","v":2},{"$f":"X2+X5+X7","v":4},null,null,null,{"$f":"IF(C2=\"\",(-90000),(E2*1000)+(G2*100)+D2-(F2*500)-(H2*50)-N2)","v":3},{"$f":"IF(D2=0,\"\",RANK(L2,L2:L5))","v":3},null,{"$f":"IF(C2=\"\",\"\",C2)","v":"Marco Weber"},null,1,"10:00:00",{"$f":"C2","v":"Marco Weber"},{"$f":"C3","v":"Moritz Thomas"},null,null,0,2,{"$f":"IF(W2+X2>0,1)","v":1},{"$f":"IF(W2>X2,1,0)","v":0},{"$f":"IF(X2>W2,1,0)","v":1},null,53]
[null,2,{"$f":"Spieler!B6","v":"Moritz Thomas"},{"$f":"Y2+Y4+Y6","v":3},{"$f":"AA2+Z4+Z6","v":2},{"$f":"Z2+AA4+AA6","v":1},{"$f":"X2+W4+W6","v":4},{"$f":"W2+X4+X6","v":2},null,null,null,{"$f":"IF(C3=\"\",(-90000),(E3*1000)+(G3*100)+D3-(F3*500)-(H3*50)-N3)","v":1803},{"$f":"IF(D3=0,\"\",RANK(L3,L2:L5))","v":2},null,{"$f":"IF(C3=\"\",\"\",C3)","v":"Moritz Thomas"},null,2,"10:39:00",{"$f":"IF(C5=\"\",\"\",C4)","v":"Daniel Schneider"},{"$f":"IF(S3=\"\",\"\",C5)","v":"Andreas Hartung"},null,"63, 55",2,0,{"$f":"IF(W3+X3>0,1)","v":1},{"$f":"IF(W3>X3,1,0)","v":1},{"$f":"IF(X3>W3,1,0)","v":0}]
[null,3,{"$f":"Spieler!B13","v":"Daniel Schneider"},{"$f":"Y3+Y4+Y7","v":3},{"$f":"Z3+AA4+AA7","v":3},{"$f":"AA3+Z4+Z7","v":0},{"$f":"W3+X4+X7","v":6},{"$f":"X3+W4+W7","v":0},null,null,null,3603,{"$f":"IF(D4=0,\"\",RANK(L4,L2:L5))","v":1},null,"Daniel Schneider",null,3,"11:06:00",{"$f":"T2","v":"Moritz Thomas"},{"$f":"C4","v":"Daniel Schneider"},null,null,0,2,1,0,1,null,"39,32,33"]
[null,4,{"$f":"Spieler!B17","v":"Andreas Hartung"},{"$f":"Y3+Y6+Y5","v":3},{"$f":"AA3+AA6+AA5","v":0},{"$f":"Z3+Z6+Z5","v":3},{"$f":"X3+X6+X5","v":0},{"$f":"W3+W6+W5","v":6},null,null,null,-1797,{"$f":"IF(D5=0,\"\",RANK(L5,L2:L5))","v":4},null,"Andreas Hartung",null,4,"11:35:00",{"$f":"IF(C5=\"\",\"\",S2)","v":"Marco Weber"},{"$f":"C5","v":"Andreas Hartung"},null,"56,37",2,0,1,1,0]
[null,null,null,null,null,null,null,null,null,null,null,null,null,null,null,null,5,"12:01:00",{"$f":"IF(C5=\"\",\"\",C3)","v":"Moritz Thomas"},{"$f":"IF(S6=\"\",\"\",C5)","v":"Andreas Hartung"},null,"31",2,0,1,1,0]
[null,null,null,null,null,null,null,null,null,null,null,null,null,null,null,null,6,"13:15:00",{"$f":"C2","v":"Marco Weber"},{"$f":"C4","v":"Daniel Schneider"},null,null,0,2,1,0,1]
[]
[]
["B",null,"Spieler","M","W","L","F+","F-",null,null,null,"Rang","Rang","P+",null,null,null,"Startzeit","Spieler","Spieler",null,"Breaks 30+","F+","F-",null,null,null,null,"Breaks 30+"]
[null,1,{"$f":"Spieler!B3","v":"Tino Delling"},{"$f":"Y11+Y14+Y16","v":3},{"$f":"Z11+Z14+Z16","v":3},{"$f":"AA11+AA14+AA16","v":0},{"$f":"W11+W14+W16","v":6},{"$f":"X11+X14+X16","v":0},null,null,null,{"$f":"IF(C11=\"\",(-90000),(E11*1000)+(G11*100)+D11-(F11*500)-(H11*50)-N11)","v":3603},{"$f":"IF(D11=0,\"\",RANK(L11,L11:L14))","v":1},null,{"$f":"IF(C11=\"\",\"\",C11)","v":"Tino Delling"},null,1,"10:00:00",{"$f":"C11","v":"Tino Delling"},{"$f":"C12","v":"Gustav Hollnagel"},null,null,2,0,{"$f":"IF(W11+X11>0,1)","v":1},{"$f":"IF(W11>X11,1,0)","v":1},{"$f":"IF(X11>W11,1,0)","v":0}]
[null,2,{"$f":"Spieler!B7","v":"Gustav Hollnagel"},{"$f":"Y11+Y13+Y15","v":3},{"$f":"AA11+Z13+Z15","v":2},{"$f":"Z11+AA13+AA15","v":1},{"$f":"X11+W13+W15","v":4},{"$f":"W11+X13+X15","v":3},null,null,null,{"$f":"IF(C12=\"\",(-90000),(E12*1000)+(G12*100)+D12-(F12*500)-(H12*50)-N12)","v":1753},{"$f":"IF(D12=0,\"\",RANK(L12,L11:L14))","v":2},null,{"$f":"IF(C12=\"\",\"\",C12)","v":"Gustav Hollnagel"},null,2,"10:43:00",{"$f":"IF(C14=\"\",\"\",C13)","v":"Sven Ohlenroth"},{"$f":"IF(S12=\"\",\"\",C14)","v":"Christopher Jaritz"},null,null,0,2,{"$f":"IF(W12+X12>0,1)","v":1},{"$f":"IF(W12>X12,1,0)","v":0},{"$f":"IF(X12>W12,1,0)","v":1}]
[null,3,{"$f":"Spieler!B12","v":"Sven Ohlenroth"},{"$f":"Y12+Y13+Y16","v":3},{"$f":"Z12+AA13+AA16","v":0},{"$f":"AA12+Z13+Z16","v":3},{"$f":"W12+X13+X16","v":0},{"$f":"X12+W13+W16","v":6},null,null,null,-1797,{"$f":"IF(D13=0,\"\",RANK(L13,L11:L14))","v":4},null,"Sven Ohlenroth",null,3,"11:54:00",{"$f":"T11","v":"Gustav Hollnagel"},{"$f":"C13","v":"Sven Ohlenroth"},null,null,2,0,1,1,0]
[null,4,{"$f":"Spieler!B16","v":"Christopher Jaritz"},{"$f":"Y12+Y15+Y14","v":3},{"$f":"AA12+AA15+AA14","v":1},{"$f":"Z12+Z15+Z14","v":2},{"$f":"X12+X15+X14","v":3},{"$f":"W12+W15+W14","v":4},null,null,null,103,{"$f":"IF(D14=0,\"\",RANK(L14,L11:L14))","v":3},null,"Christopher Jaritz",null,4,"12:42:00",{"$f":"IF(C14=\"\",\"\",S11)","v":"Tino Delling"},{"$f":"C14","v":"Christopher Jaritz"},null,null,2,0,1,1,0]
[null,null,null,null,null,null,null,null,null,null,null,null,null,null,null,null,5,"13:23:00",{"$f":"IF(C14=\"\",\"\",C12)","v":"Gustav Hollnagel"},{"$f":"IF(S15=\"\",\"\",C14)","v":"Christopher Jaritz"},null,null,2,1,1,1,0]
[null,null,null,null,null,null,null,null,null,null,null,null,null,null,null,null,6,"13:43:00",{"$f":"C11","v":"Tino Delling"},{"$f":"C13","v":"Sven Ohlenroth"},null,"31",2,0,1,1,0]
[]
[]
["C",null,"Spieler","M","W","L","F+","F-",null,null,null,"Rang","Rang","P+",null,null,null,"Startzeit","Spieler","Spieler",null,"Breaks 30+","F+","F-",null,null,null,null,"Breaks 30+"]
[null,1,{"$f":"Spieler!B4","v":"Marec Stachly"},{"$f":"Y20+Y23+Y25","v":3},{"$f":"Z20+Z23+Z25","v":3},{"$f":"AA20+AA23+AA25","v":0},{"$f":"W20+W23+W25","v":6},{"$f":"X20+X23+X25","v":0},null,null,null,{"$f":"IF(C20=\"\",(-90000),(E20*1000)+(G20*100)+D20-(F20*500)-(H20*50)-N20)","v":3603},{"$f":"IF(D20=0,\"\",RANK(L20,L20:L23))","v":1},null,{"$f":"IF(C20=\"\",\"\",C20)","v":"Marec Stachly"},null,1,"10:00:00",{"$f":"C20","v":"Marec Stachly"},{"$f":"C21","v":"Michael Kandler"},null,null,2,0,{"$f":"IF(W20+X20>0,1)","v":1},{"$f":"IF(W20>X20,1,0)","v":1},{"$f":"IF(X20>W20,1,0)","v":0}]
[null,2,{"$f":"Spieler!B8","v":"Michael Kandler"},{"$f":"Y20+Y22+Y24","v":3},{"$f":"AA20+Z22+Z24","v":2},{"$f":"Z20+AA22+AA24","v":1},{"$f":"X20+W22+W24","v":4},{"$f":"W20+X22+X24","v":4},null,null,null,{"$f":"IF(C21=\"\",(-90000),(E21*1000)+(G21*100)+D21-(F21*500)-(H21*50)-N21)","v":1703},{"$f":"IF(D21=0,\"\",RANK(L21,L20:L23))","v":2},null,{"$f":"IF(C21=\"\",\"\",C21)","v":"Michael Kandler"},null,2,"10:51:00",{"$f":"IF(C23=\"\",\"\",C22)","v":"Andy Swennen"},{"$f":"IF(S21=\"\",\"\",C23)","v":"Jörg Bonitz"},null,null,2,0,{"$f":"IF(W21+X21>0,1)","v":1},{"$f":"IF(W21>X21,1,0)","v":1},{"$f":"IF(X21>W21,1,0)","v":0}]
[null,3,{"$f":"Spieler!B11","v":"Andy Swennen"},{"$f":"Y21+Y22+Y25","v":3},{"$f":"Z21+AA22+AA25","v":1},{"$f":"AA21+Z22+Z25","v":2},{"$f":"W21+X22+X25","v":3},{"$f":"X21+W22+W25","v":4},null,null,null,103,{"$f":"IF(D22=0,\"\",RANK(L22,L20:L23))","v":3},null,"Andy Swennen",null,3,"11:34:00",{"$f":"T20","v":"Michael Kandler"},{"$f":"C22","v":"Andy Swennen"},null,null,2,1,1,1,0]
[null,4,{"$f":"Spieler!B15","v":"Jörg Bonitz"},{"$f":"Y21+Y24+Y23","v":3},{"$f":"AA21+AA24+AA23","v":0},{"$f":"Z21+Z24+Z23","v":3},{"$f":"X21+X24+X23","v":1},{"$f":"W21+W24+W23","v":6},null,null,null,-1697,{"$f":"IF(D23=0,\"\",RANK(L23,L20:L23))","v":4},null,"Jörg Bonitz",null,4,"12:50:00",{"$f":"IF(C23=\"\",\"\",S20)","v":"Marec Stachly"},{"$f":"C23","v":"Jörg Bonitz"},null,null,2,0,1,1,0]
[null,null,null,null,null,null,null,null,null,null,null,null,null,null,null,null,5,"13:34:00",{"$f":"IF(C23=\"\",\"\",C21)","v":"Michael Kandler"},{"$f":"IF(S24=\"\",\"\",C23)","v":"Jörg Bonitz"},null,null,2,1,1,1,0]
[null,null,null,null,null,null,null,null,null,null,null,null,null,null,null,null,6,"14:12:00",{"$f":"C20","v":"Marec Stachly"},{"$f":"C22","v":"Andy Swennen"},null,null,2,0,1,1,0]
[]
[]
["D",null,"Spieler","M","W","L","F+","F-",null,null,null,"Rang","Rang","P+",null,null,null,"Startzeit","Spieler","Spieler",null,"Breaks 30+","F+","F-",null,null,null,null,"Breaks 30+"]
[null,1,{"$f":"Spieler!B5","v":"Felix Kirsten"},{"$f":"Y29+Y32+Y34","v":3},{"$f":"Z29+Z32+Z34","v":3},{"$f":"AA29+AA32+AA34","v":0},{"$f":"W29+W32+W34","v":6},{"$f":"X29+X32+X34","v":0},null,null,null,{"$f":"IF(C29=\"\",(-90000),(E29*1000)+(G29*100)+D29-(F29*500)-(H29*50)-N29)","v":3603},{"$f":"IF(D29=0,\"\",RANK(L29,L29:L32))","v":1},null,{"$f":"IF(C29=\"\",\"\",C29)","v":"Felix Kirsten"},null,1,"10:00:00",{"$f":"C29","v":"Felix Kirsten"},{"$f":"C30","v":"Aaron Bocksberger"},null,null,2,0,{"$f":"IF(W29+X29>0,1)","v":1},{"$f":"IF(W29>X29,1,0)","v":1},{"$f":"IF(X29>W29,1,0)","v":0}]
[null,2,{"$f":"Spieler!B9","v":"Aaron Bocksberger"},{"$f":"Y29+Y31+Y33","v":3},{"$f":"AA29+Z31+Z33","v":1},{"$f":"Z29+AA31+AA33","v":2},{"$f":"X29+W31+W33","v":2},{"$f":"W29+X31+X33","v":4},null,null,null,{"$f":"IF(C30=\"\",(-90000),(E30*1000)+(G30*100)+D30-(F30*500)-(H30*50)-N30)","v":2},{"$f":"IF(D30=0,\"\",RANK(L30,L29:L32))","v":2},1,{"$f":"IF(C30=\"\",\"\",C30)","v":"Aaron Bocksberger"},null,2,"11:01:00",{"$f":"IF(C32=\"\",\"\",C31)","v":"Marko Straßburger"},{"$f":"IF(S30=\"\",\"\",C32)","v":"David Gärtner"},null,null,2,0,{"$f":"IF(W30+X30>0,1)","v":1},{"$f":"IF(W30>X30,1,0)","v":1},{"$f":"IF(X30>W30,1,0)","v":0}]
[null,3,{"$f":"Spieler!B10","v":"Marko Straßburger"},{"$f":"Y30+Y31+Y34","v":3},{"$f":"Z30+AA31+AA34","v":1},{"$f":"AA30+Z31+Z34","v":2},{"$f":"W30+X31+X34","v":2},{"$f":"X30+W31+W34","v":4},null,null,null,0,{"$f":"IF(D31=0,\"\",RANK(L31,L29:L32))","v":4},3,"Marko Straßburger",null,3,"11:56:00",{"$f":"T29","v":"Aaron Bocksberger"},{"$f":"C31","v":"Marko Straßburger"},null,null,2,0,1,1,0]
[null,4,{"$f":"Spieler!B14","v":"David Gärtner"},{"$f":"Y30+Y33+Y32","v":3},{"$f":"AA30+AA33+AA32","v":1},{"$f":"Z30+Z33+Z32","v":2},{"$f":"X30+X33+X32","v":2},{"$f":"W30+W33+W32","v":4},null,null,null,1,{"$f":"IF(D32=0,\"\",RANK(L32,L29:L32))","v":3},2,"David Gärtner",null,4,"13:09:00",{"$f":"IF(C32=\"\",\"\",S29)","v":"Felix Kirsten"},{"$f":"C32","v":"David Gärtner"},null,"49",2,0,1,1,0]
[null,null,null,null,null,null,null,null,null,null,null,null,null,null,null,null,5,"13:47:00",{"$f":"IF(C32=\"\",\"\",C30)","v":"Aaron Bocksberger"},{"$f":"IF(S33=\"\",\"\",C32)","v":"David Gärtner"},null,null,0,2,1,0,1]
[null,null,null,null,null,null,null,null,null,null,null,null,null,null,null,null,6,"14:28:00",{"$f":"C29","v":"Felix Kirsten"},{"$f":"C31","v":"Marko Straßburger"},null,null,2,0,1,1,0]

{"sheet":"Finals","index":2,"n_rows":18,"n_cols":17,"rows_kept":18,"cut":false,"hidden":false,"merged":[[2,0,3,0],[5,0,6,0],[9,0,10,0],[12,0,13,0],[0,1,0,16],[1,15,1,16],[6,9,6,11],[5,4,6,4],[9,4,10,4]]}
[null,"CHAMPIONS CUP - 2020 -Finals"]
[null,"Viertelfinals","Bo5","Break",null,"Halbfinals","Bo5","Break",null,"Finals","Bo5","Break",null,null,null,"Ranking"]
[1,{"$f":"IFERROR(VLOOKUP(1,Gruppen!M2:O5,3,FALSE),\"\")","v":"Daniel Schneider"},3,41,null,null,null,null,null,null,null,null,null,null,null,1,{"$f":"IF($K$8<$K$9,$J$9,IF($K$9<$K$8,$J$8,\"\"))","v":"Felix Kirsten"}]
[null,{"$f":"IFERROR(VLOOKUP(2,Gruppen!M29:O32,3,FALSE),\"\")","v":"Aaron Bocksberger"},2,null,null,null,null,null,null,null,null,null,null,null,null,2,{"$f":"IF($K$8>$K$9,$J$9,IF($K$9>$K$8,$J$8,\"\"))","v":"Daniel Schneider"}]
[null,null,null,null,null,null,null,null,null,null,null,null,null,null,null,3,{"$f":"IF($K$13>$K$14,$J$13,IF($K$14>$K$13,$J$14,\"\"))","v":"Gustav Hollnagel"}]
[2,{"$f":"IFERROR(VLOOKUP(1,Gruppen!M11:O14,3,FALSE),\"\")","v":"Tino Delling"},3,null,1,{"$f":"IF(C3=C4,\"\",IF(C3>C4,B3,B4))","v":"Daniel Schneider"},3,32,null,null,null,null,null,null,null,4,{"$f":"IF($K$13<$K$14,$J$13,IF($K$14<$K$13,$J$14,\"\"))","v":"Tino Delling"}]
[null,{"$f":"IFERROR(VLOOKUP(2,Gruppen!M20:O23,3,FALSE),\"\")","v":"Michael Kandler"},1,null,null,{"$f":"IF($C$6=$C$7,\"\",IF($C$6>$C$7,$B$6,$B$7))","v":"Tino Delling"},0,null,null,"FINALE CHAMPIONS CUP",null,null,null,"Sieger",null,5,{"$f":"IF(C3>C4,B4,IF(C4>C3,B3,\"\"))","v":"Aaron Bocksberger"}]
[null,null,null,null,null,null,null,null,null,{"$f":"IF(G6=G7,\"\",IF(G6>G7,F6,F7))","v":"Daniel Schneider"},2,"51,40,45",null,{"$f":"IF(K8=K9,\"\",IF(K8>K9,J8,J9))","v":"Felix Kirsten"},null,5,{"$f":"IF(C6>C7,B7,IF(C7>C6,B6,\"\"))","v":"Michael Kandler"}]
[null,null,null,null,null,null,null,null,null,{"$f":"IF(G10=G11,\"\",IF(G10>G11,F10,F11))","v":"Felix Kirsten"},3,43.37,null,null,null,5,{"$f":"IF(C10>C11,B11,IF(C11>C10,B10,\"\"))","v":"Marec Stachly"}]
[3,{"$f":"IFERROR(VLOOKUP(1,Gruppen!M20:O23,3,FALSE),\"\")","v":"Marec Stachly"},1,null,2,{"$f":"IF(C10=C11,\"\",IF(C10>C11,B10,B11))","v":"Gustav Hollnagel"},1,38,null,null,null,null,null,null,null,5,{"$f":"IF(C13>C14,B14,IF(C14>C13,B13,\"\"))","v":"Moritz Thomas"}]
[null,{"$f":"IFERROR(VLOOKUP(2,Gruppen!M11:O14,3,FALSE),\"\")","v":"Gustav Hollnagel"},3,30,null,{"$f":"IF($C$13=$C$14,\"\",IF($C$13>$C$14,$B$13,$B$14))","v":"Felix Kirsten"},3,30,null,null,null,null,null,null,null,9,{"$f":"_xlfn.IFNA(VLOOKUP(3,Gruppen!$M$2:$O$5,3,FALSE),\"\")","v":"Marco Weber"}]
[null,null,null,null,null,null,null,null,null,"Spiel um Platz 3","Bo3",null,null,"Dritter",null,9,{"$f":"_xlfn.IFNA(VLOOKUP(3,Gruppen!$M$11:$O$14,3,FALSE),\"\")","v":"Christopher Jaritz"}]
[4,{"$f":"IFERROR(VLOOKUP(1,Gruppen!M29:O32,3,FALSE),\"\")","v":"Felix Kirsten"},3,null,null,null,null,null,null,{"$f":"IF(G6=G7,\"\",IF(G6<G7,F6,F7))","v":"Tino Delling"},1,null,null,{"$f":"IF(K13=K14,\"\",IF(K13>K14,J13,J14))","v":"Gustav Hollnagel"},null,9,{"$f":"_xlfn.IFNA(VLOOKUP(3,Gruppen!$M$20:$O$23,3,FALSE),\"\")","v":"Andy Swennen"}]
[null,{"$f":"IFERROR(VLOOKUP(2,Gruppen!M2:O5,3,FALSE),\"\")","v":"Moritz Thomas"},2,48,null,null,null,null,null,{"$f":"IF(G10=G11,\"\",IF(G10<G11,F10,F11))","v":"Gustav Hollnagel"},2,null,null,null,null,9,{"$f":"_xlfn.IFNA(VLOOKUP(3,Gruppen!$M$29:$O$32,3,FALSE),\"\")","v":"David Gärtner"}]
[null,null,null,null,null,null,null,null,null,null,null,null,null,null,null,13,{"$f":"_xlfn.IFNA(VLOOKUP(4,Gruppen!$M$2:$O$5,3,FALSE),\"\")","v":"Andreas Hartung"}]
[null,null,null,null,null,null,null,null,null,null,null,null,null,null,null,13,{"$f":"_xlfn.IFNA(VLOOKUP(4,Gruppen!$M$11:$O$14,3,FALSE),\"\")","v":"Sven Ohlenroth"}]
[null,null,null,null,null,null,null,null,null,null,null,null,null,null,null,13,{"$f":"_xlfn.IFNA(VLOOKUP(4,Gruppen!$M$20:$O$23,3,FALSE),\"\")","v":"Jörg Bonitz"}]
[null,null,null,null,null,null,null,null,null,null,null,null,null,null,null,13,{"$f":"_xlfn.IFNA(VLOOKUP(4,Gruppen!$M$29:$O$32,3,FALSE),\"\")","v":"Marko Straßburger"}]